{"text_format":"1","workbook":"xlsx","n_sheets":14,"sheets":["Start Here","Espanol Empiece Aqui","CS Worksheet","Schedule A","Self Employment Calculator","Schedule B","Schedule C","Schedule D","Schedule D Supplemental Tables","Schedule E","Schedule E Supplemental Tables","Footnotes","Explanation of Terms","BCSO"],"not_rendered":{"charts":0,"images":8,"macros":1,"external_links":0,"defined_names":624,"comments":8,"pivot_tables":0},"unopened":[],"bounds":{"document_bytes":16777216,"sheet_cells":100000,"rows_first":2000,"rows_last":500,"rows_between":2000,"halvings":0,"cell_chars":16384,"cell_head_chars":4096},"cells_cut":0,"cells_raw":0,"read":"whole","date_system":"1900"}

{"sheet":"Start Here","index":0,"n_rows":127,"n_cols":4,"rows_kept":127,"cut":false,"hidden":false,"merged":[[1,1,1,3],[3,1,3,3],[4,1,4,3],[5,1,5,3],[9,1,9,3],[8,1,8,3],[15,1,15,3],[16,1,16,3],[39,1,39,3],[14,1,14,3],[10,1,10,3],[19,1,19,3],[35,1,35,3],[38,1,38,3],[96,2,96,3],[65,2,65,3],[69,2,69,3],[73,2,73,3],[41,2,41,3],[52,2,52,3],[50,2,50,3],[54,2,54,3],[56,2,56,3],[66,2,66,3],[81,2,81,3],[61,1,61,3],[58,1,58,3],[90,2,90,3],[77,2,77,3],[82,2,82,3],[84,2,84,3],[85,2,85,3],[86,2,86,3],[95,2,95,3],[91,2,91,3],[87,2,87,3],[92,2,92,3],[99,2,99,3],[126,1,126,3],[113,2,113,3],[116,2,116,3],[119,2,119,3],[122,2,122,3],[109,2,109,3],[110,2,110,3],[103,2,103,3],[106,2,106,3],[102,2,102,3]]}
[]
[null,"Georgia Child Support Guidelines Calculators"]
[]
[null,"Helpful Information for Using the"]
[null,"Excel™ Downloadable Electronic Worksheet"]
[null,"(Electronically Calculates the Child Support Obligation)"]
[]
[null,"1)  General Information"]
{"$rows_left_out":120}
{"sheet":"Espanol Empiece Aqui","index":1,"n_rows":125,"n_cols":4,"rows_kept":125,"cut":false,"hidden":false,"merged":[[8,1,8,3],[1,1,1,3],[3,1,3,3],[4,1,4,3],[5,1,5,3],[7,1,7,3],[38,1,38,3],[9,1,9,3],[10,1,10,3],[11,1,11,3],[13,1,13,3],[14,1,14,3],[15,1,15,3],[17,1,17,3],[18,1,18,3],[34,1,34,3],[36,1,36,3],[37,1,37,3],[58,1,58,3],[40,2,40,3],[42,2,42,3],[43,2,43,3],[44,2,44,3],[45,2,45,3],[46,2,46,3],[47,2,47,3],[50,2,50,3],[52,2,52,3],[54,2,54,3],[56,2,56,3],[75,1,75,3],[60,1,60,3],[61,1,61,3],[63,1,63,3],[65,2,65,3],[66,2,66,3],[67,1,67,3],[69,2,69,3],[71,1,71,3],[73,2,73,3],[93,2,93,3],[77,2,77,3],[79,1,79,3],[81,1,81,3],[82,2,82,3],[83,2,83,3],[85,2,85,3],[86,2,86,3],[87,2,87,3],[89,1,89,3],[90,2,90,3],[92,1,92,3],[110,1,110,3],[94,2,94,3],[96,1,96,3],[97,2,97,3],[99,1,99,3],[100,2,100,3],[101,2,101,3],[103,1,103,3],[104,2,104,3],[106,1,106,3],[107,2,107,3],[108,2,108,3],[120,2,120,3],[122,1,122,3],[124,1,124,3],[111,2,111,3],[113,1,113,3],[114,2,114,3],[116,1,116,3],[117,2,117,3],[119,1,119,3]]}
[]
[null,"Pautas Para las Calculadora de Manutención Infantil de Georgia"]
[]
[null,"Información útil para usar la"]
[null,"Hoja de Cálculo Excel™ Descargable"]
[null,"(Calcula Electrónicamente la Obligación de la Manutención Infantil)"]
[]
[null,"1) Información General"]
{"$rows_left_out":118}
{"sheet":"CS Worksheet","index":2,"n_rows":234,"n_cols":13,"rows_kept":234,"cut":false,"hidden":false,"merged":[[35,3,35,9],[14,1,14,12],[36,10,37,10],[25,11,25,12],[30,11,32,11],[30,12,32,12],[28,1,28,9],[26,5,26,6],[30,10,32,10],[36,11,37,11],[35,1,35,2],[21,9,21,11],[22,9,22,11],[18,9,18,11],[22,3,22,5],[17,9,17,11],[26,8,26,9],[29,1,29,2],[30,1,32,2],[33,1,33,2],[16,3,16,5],[16,9,16,11],[24,11,24,12],[68,1,68,12],[65,1,65,12],[66,2,66,6],[11,1,11,4],[25,7,25,9],[16,1,16,2],[16,7,16,8],[13,10,13,12],[13,1,13,3],[13,4,13,6],[36,1,37,2],[30,3,30,9],[33,3,33,9],[49,3,49,9],[52,1,53,2],[55,1,55,12],[56,3,56,9],[56,1,56,2],[54,1,54,12],[52,11,53,11],[52,10,53,10],[57,1,57,12],[47,10,48,10],[47,11,48,11],[3,14,3,15],[5,8,5,9],[11,5,11,6],[5,10,5,11],[3,10,3,11],[36,3,36,9],[37,3,37,9],[40,3,40,9],[46,3,46,9],[44,11,46,11],[41,1,41,12],[36,12,37,12],[38,3,38,9],[45,3,45,9],[44,3,44,9],[44,10,46,10],[38,1,38,2],[39,1,39,2],[43,1,43,9],[39,3,39,9],[40,1,40,2],[46,1,46,2],[34,1,34,2],[34,3,34,9],[52,3,53,9],[47,3,48,9],[49,1,49,2],[44,1,45,2],[47,1,48,2],[9,2,9,3],[10,2,10,3],[3,8,3,9],[8,1,8,5],[5,1,5,5],[4,1,4,6],[7,8,7,9],[7,1,7,6],[6,1,6,5],[8,8,8,12],[21,3,21,5],[19,9,19,11],[20,9,20,11],[26,11,26,12],[24,5,24,6],[31,3,32,9],[29,3,29,9],[24,8,24,9],[26,1,26,4],[0,8,0,9],[18,3,18,5],[19,3,19,5],[20,3,20,5],[0,6,0,7],[1,1,1,12],[13,7,13,9],[17,3,17,5],[2,2,2,3],[15,1,15,8],[15,9,15,11]]}
[null,null,null,null,"IN THE",null,"COURT OF",null,null,null,"COUNTY"]
[null,"STATE OF GEORGIA"]
[null,false,"DHS, ex rel., o/b/o"]
[null,null,null,null,null,null,null,null,"Civil Action Case No.:"]
[null,null,null,null,null,null,null,null,null," "]
[null,"* Plaintiff,",null,null,null,null,null,null,"IV-D Case No.:"]
[null,"vs.",null,null,null,null,null,"    ","    ",null,null,null," "]
[null,null,null,null,null,null,null,null,"Comments for Court:"]
{"$rows_left_out":227}
{"sheet":"Schedule A","index":3,"n_rows":37,"n_cols":5,"rows_kept":37,"cut":false,"hidden":false,"merged":[[0,0,0,1],[29,0,29,4],[30,0,30,3],[31,0,31,4],[32,0,32,3],[33,0,33,4],[34,0,34,11],[3,0,3,4],[1,4,2,4],[1,0,1,1],[4,0,4,4]]}
["* Schedule A - Gross Income  The entry of income in this section is required to generate a Worksheet.",null,"(a) Mother","(b) Father","(c) Combined"]
["If a parent receives TANF, click in box, check mark will appear; click again to remove check mark; otherwise leave blank.  Do not include monthly TANF check amount as income.",null,false,false]
[]
["Use Schedule A to enter Gross Income of each parent.  Enter amounts/data in yellow fields only.\nCalculations will automatically display in the appropriate white fields."]
["Convert all amounts to a monthly average."]
["1.","Salary and Wages (Do not include means-tested public assistance, such as TANF or food stamps.)",0,0]
["2.","Commissions, Fees, Tips",0,0]
["3.","Income From Self-Employment",0,0]
{"$rows_left_out":30}
{"sheet":"Self Employment Calculator","index":4,"n_rows":56,"n_cols":5,"rows_kept":56,"cut":false,"hidden":false,"merged":[[51,1,51,4],[3,1,3,5],[11,2,11,4],[0,1,0,4],[1,1,1,4],[2,1,2,4],[36,1,36,2],[48,1,48,4]]}
[null,"Self-Employment Calculator  -  O.C.G.A. §19-6-15(f)(1)(B) states, \"Income from self-employment includes income from, but not limited to, business operations, work as an independent contractor or consultant, sales of goods or services, and rental properties, less ordinary and reasonable expenses necessary to produce such income.  Income from self-employment, rent, royalties, proprietorship of a business, or joint ownership of a partnership, limited liability company, or closely held corporation is defined as gross receipts minus ordinary and reasonable expenses required for self-employment or business operations.\""]
[]
[null,"Guidance: To calculate Self-Employment Income, you may use this Self-Employment Calculator OR you may enter Self-Employment income on Schedule A, Line 3. If you use this Self-Employment calculator, enter amounts below in yellow fields only. Calculations will automatically display in the appropriate fields.  If there is more than one owner in a business, ONLY include the self-employment income for a parent associated with this child support calculation."]
[]
[null,null,"Mother",null,"Father"]
[]
[null,"1) Description of Business"]
[]
{"$rows_left_out":49}
{"sheet":"Schedule B","index":5,"n_rows":57,"n_cols":8,"rows_kept":57,"cut":false,"hidden":false,"merged":[[0,0,0,4],[26,0,26,6],[9,0,9,6],[28,0,28,6],[25,0,25,6],[23,1,23,5],[24,1,24,5],[7,1,7,4],[8,0,8,5],[53,1,53,4],[43,1,43,3],[50,1,50,4],[51,1,51,4],[52,1,52,4],[48,0,48,6],[44,0,44,6],[46,0,46,6],[47,0,47,6],[42,1,42,3],[45,0,45,6],[41,1,41,3],[36,0,42,0],[40,1,40,3],[36,1,36,3],[37,1,37,3],[32,1,32,6],[33,1,33,6],[31,1,31,6],[39,1,39,3],[38,1,38,3],[34,1,34,6],[35,0,35,6],[30,1,30,6],[27,0,27,6],[1,1,1,4],[2,0,2,6],[3,1,3,4],[4,1,4,4],[5,1,5,4],[6,1,6,4],[29,0,29,6]]}
["Schedule B-Adjusted Income  -  Enter amounts/data in yellow fields only.  Calculations will automatically display in the appropriate white fields.",null,null,null,null,"(a) Mother","(b)Father"]
["1.","Total Gross Monthly Income from Schedule A, Line 24",null,null,null,{"$f":"'Schedule A'!C29","v":0},{"$f":"'Schedule A'!D29","v":0}]
["Self Employment Tax Adjustment"]
["2.","Enter monthly Self-Employment Income on which parent paid Self-Employment Taxes for FICA & Medicare",null,null,null,0,0]
["3.","FICA (Line 2 multiplied by .062)",null,null,null,{"$f":"tround(IF(F4*0.062>612.25,612.25,F4*0.062))","v":0},{"$f":"tround(IF(G4*0.062>612.25,612.25,G4*0.062))","v":0}]
["4.","Medicare tax (Line 2 multiplied by 0.0145)",null,null,null,{"$f":"tround(F4*0.0145)","v":0},{"$f":"tround(G4*0.0145)","v":0}]
["5.","Total of Lines 3 & 4",null,null,null,{"$f":"SUM(F5:F6)","v":0},{"$f":"SUM(G5:G6)","v":0}]
["6.","Line 5 subtracted from Line 1",null,null,null,{"$f":"IF(F2-F7<0,0,F2-F7)","v":0},{"$f":"IF(G2-G7<0,0,G2-G7)","v":0}]
{"$rows_left_out":50}
{"sheet":"Schedule C","index":6,"n_rows":1,"n_cols":1,"rows_kept":1,"cut":false,"hidden":false,"merged":[[0,0,40,14]]}
["Schedule C is not in use and is intentionally left blank"]

{"sheet":"Schedule D","index":7,"n_rows":36,"n_cols":8,"rows_kept":36,"cut":false,"hidden":false,"merged":[[0,0,0,1],[7,0,7,5],[11,0,11,1],[18,0,18,1],[8,1,9,1],[8,0,9,0]]}
["Schedule D-Additional Expenses  -  Enter amounts/data in yellow fields only.  Calculations will automatically display in the appropriate white fields on this schedule.",null,"(a) Mother","(b)Father","(c) Nonparent Custodian","(d) Combined"]
["1.","Child Care Expenses necessary for parent's employment, education or vocational training.  Monthly average amount paid by each Parent (or Nonparent Custodian) for child care for the children for whom support is being determined from all Supplemental Tables from Lines 7, 13 and 19.",{"$f":"SROUND(SUM(F17,'Schedule D Supplemental Tables'!F9,'Schedule D Supplemental Tables'!F37,'Schedule D Supplemental Tables'!F66))","v":{"$error":"#NAME?"}},{"$f":"SROUND(SUM(F24,'Schedule D Supplemental Tables'!F16,'Schedule D Supplemental Tables'!F44,'Schedule D Supplemental Tables'!F73))","v":{"$error":"#NAME?"}},{"$f":"SROUND(SUM(F31,'Schedule D Supplemental Tables'!F23,'Schedule D Supplemental Tables'!F51,'Schedule D Supplemental Tables'!F80))","v":{"$error":"#NAME?"}},{"$f":"SUM(C2:E2)","v":{"$error":"#NAME?"}}]
["2.","Health Insurance Premiums Paid for the Children\nEnter monthly amount paid or will be paid by each parent or Nonparent Custodian for health insurance.  (If portion is unknown, prorate for children by dividing total premium by number of persons covered then multiply by number of covered children in this action.)",0,0,0,{"$f":"SUM(C3:E3)","v":0}]
[null,"Enter monthly amount paid or will be paid by each parent or Nonparent Custodian for health insurance.  (If portion is unknown, prorate for children by dividing total premium by number of persons covered then multiply by number of covered children in this action.)"]
["3.","Total Monthly Additional Expenses (Line 1 plus Line 2)",{"$f":"SUM(C2:C4)","v":{"$error":"#NAME?"}},{"$f":"SUM(D2:D4)","v":{"$error":"#NAME?"}},{"$f":"SUM(E2:E4)","v":{"$error":"#NAME?"}},{"$f":"SUM(F2:F4)","v":{"$error":"#NAME?"}}]
["4.","Pro Rata Share of Parents' Income (from Child Support Worksheet Line 3)",{"$f":"(CROUND(IF('CS Worksheet'!K31>0,IF(SUM('CS Worksheet'!K31:L31)<800,('CS Worksheet'!K31/(SUM('CS Worksheet'!K31:L31))),'CS Worksheet'!K31/'CS Worksheet'!M31),0)))","v":{"$error":"#NAME?"}},{"$f":"(CROUND(IF('CS Worksheet'!L31>0,IF(SUM('CS Worksheet'!K31:L31)<800,('CS Worksheet'!L31/(SUM('CS Worksheet'!K31:L31))),'CS Worksheet'!L31/'CS Worksheet'!M31))))","v":{"$error":"#NAME?"}},null,{"$f":"SUM(C6:D6)","v":{"$error":"#NAME?"}}]
["5.","Pro Rata Share of Additional Expenses.  Amount in Column (d) of Line 3 is multiplied by percentages on Line 4.  Results automatically display on Line 6 of Worksheet.",{"$f":"CROUND(F5*(CROUND(IF('CS Worksheet'!K31>0,IF(SUM('CS Worksheet'!K31:L31)<800,('CS Worksheet'!K31/(SUM('CS Worksheet'!K31:L31))),'CS Worksheet'!K31/'CS Worksheet'!M31),0))))","v":{"$error":"#NAME?"}},{"$f":"(F5)-C7","v":{"$error":"#NAME?"}},null,{"$f":"SUM(C7:D7)","v":{"$error":"#NAME?"}}]
["Supplemental Table 1.  Use this table to calculate amounts for line 1 Schedule D, children 1, 2 and 3.\nFor additional children use Supplemental Table 2, 3, and/or 4."]
{"$rows_left_out":29}
{"sheet":"Schedule D Supplemental Tables","index":8,"n_rows":85,"n_cols":6,"rows_kept":85,"cut":false,"hidden":false,"merged":[[57,0,57,5],[58,1,59,1],[58,0,59,0],[0,0,0,5],[28,0,28,5],[1,0,2,0],[1,1,2,1],[29,1,30,1],[29,0,30,0]]}
["Schedule D-Additional Expenses-Supplemental Table 2.  Use this table to calculate amounts for Line 1 Schedule D, children 4, 5 and 6.\nFor additional children use Supplemental Tables 3 and/or 4.\nEnter amounts/data in yellow fields only.  Calculations will automatically display in the appropriate white fields."]
["1.","Children's Names →\n(Names will automatically display)"]
[null,null,"Child 4","Child 5","Child 6"]
["Child Care Paid by Mother ",null,{"$f":"CONCATENATE('CS Worksheet'!$D$21)","v":""},{"$f":"CONCATENATE('CS Worksheet'!$D$22)","v":""},{"$f":"CONCATENATE('CS Worksheet'!$D$23)","v":""},"Totals"]
["2.","Total yearly amount during school",0,0,0,{"$f":"SUMIF('CS Worksheet'!$C$21,TRUE,C5)+SUMIF('CS Worksheet'!$C$22,TRUE,D5)+SUMIF('CS Worksheet'!$C$23,TRUE,E5)","v":0}]
["3.","Total yearly amount during summer break",0,0,0,{"$f":"SUMIF('CS Worksheet'!$C$21,TRUE,C6)+SUMIF('CS Worksheet'!$C$22,TRUE,D6)+SUMIF('CS Worksheet'!$C$23,TRUE,E6)","v":0}]
["4.","Total yearly amount during other school breaks",0,0,0,{"$f":"SUMIF('CS Worksheet'!$C$21,TRUE,C7)+SUMIF('CS Worksheet'!$C$22,TRUE,D7)+SUMIF('CS Worksheet'!$C$23,TRUE,E7)","v":0}]
["5.","Total yearly amount of other child care (e.g. pre-school or child with disability)",0,0,0,{"$f":"SUMIF('CS Worksheet'!$C$21,TRUE,C8)+SUMIF('CS Worksheet'!$C$22,TRUE,D8)+SUMIF('CS Worksheet'!$C$23,TRUE,E8)","v":0}]
{"$rows_left_out":78}
{"sheet":"Schedule E","index":9,"n_rows":100,"n_cols":13,"rows_kept":100,"cut":false,"hidden":false,"merged":[[11,2,11,8],[18,1,19,4],[12,1,12,9],[13,1,13,9],[14,2,14,8],[15,1,15,8],[10,2,10,4],[40,1,40,5],[26,2,26,4],[29,2,29,4],[33,2,33,4],[37,2,37,4],[39,2,39,4],[35,2,35,4],[36,2,36,4],[30,2,30,4],[38,2,38,4],[25,2,25,4],[28,2,28,4],[31,1,31,4],[32,1,32,8],[18,7,18,8],[27,2,27,4],[21,2,21,4],[51,1,51,9],[53,2,54,5],[49,1,49,9],[48,1,48,9],[50,1,50,9],[52,1,52,9],[1,1,1,9],[0,1,0,9],[16,2,16,4],[34,2,34,4],[17,2,17,5],[7,2,7,4],[20,2,20,4],[22,2,22,4],[24,2,24,4],[23,2,23,4],[2,1,2,9],[6,2,6,4],[3,1,3,9],[4,1,4,6],[4,7,4,8],[5,2,5,4],[8,2,8,4],[9,2,9,4],[84,2,84,4],[66,2,66,4],[75,2,75,4],[74,2,74,4],[79,1,80,1],[77,1,78,1],[56,2,56,4],[57,2,57,4],[65,2,65,4],[67,1,67,4],[58,2,58,4],[62,2,62,4],[63,2,63,4],[96,2,96,4],[95,2,95,4],[94,2,94,4],[93,2,93,4],[92,2,92,4],[91,2,91,4],[88,2,88,4],[86,2,86,4],[70,2,70,4],[78,2,78,4],[76,1,76,4],[71,2,71,4],[73,2,73,4],[72,2,72,4],[90,2,90,4],[89,2,89,4],[79,2,79,4],[77,2,77,4],[80,2,80,4],[87,2,87,4],[83,2,83,4],[85,1,85,4],[81,2,81,4],[81,1,82,1],[81,9,82,9],[81,5,82,5],[77,9,78,9],[79,5,80,5],[79,9,80,9],[77,5,78,5],[69,2,69,4],[40,6,40,9],[60,2,60,4],[61,2,61,4],[68,2,68,4],[41,1,41,9],[46,1,46,9],[43,1,43,9],[45,1,45,6],[53,1,54,1],[44,2,44,4],[55,1,55,4],[64,2,64,4],[59,2,59,4],[82,2,82,4],[42,7,42,9],[42,2,42,4],[47,1,47,9]]}
[null,"Schedule E  -  Deviations and Special Circumstances"]
[null,"A.  For each section completed, provide monthly amounts (annual amounts in certain areas) or other information as required.  Enter amounts/data in yellow fields only. Calculations will automatically display in the appropriate white fields."]
[null,"Low Income Deviation\nThe Court or Jury has discretion to allow or not allow the noncustodial parent to receive a Low Income Deviation that will reduce the Presumptive Amount of Child Support.  If Low Income Deviation does not apply in this case, skip this section and begin at Line 2(a) of this Schedule."]
[null,"Weighing Considerations Based Upon Sufficient Evidence:\nWhen considering a Low Income Deviation, please read the statute at O.C.G.A. §19-6-15(i)(2)(B) or review the User Guide for the appropriate criteria for this deviation.\nIn weighing the income sources and expenses of both parents, and taking into account each parent’s basic child support obligation as adjusted by health insurance and work related child care costs –\n\n> Can the noncustodial parent provide evidence sufficient to demonstrate no earning capacity?  Or, does his/her pro rata share of the presumptive amount of child support create an extreme economic hardship for such parent?\n\n> What will be the relative hardship that a reduction in the amount of child support would have on the custodial parent's household? The needs of each parent? The needs of the child(ren) for whom child support is being determined? The ability of the noncustodial parent to pay child support?\n"]
[null,"NOTE:  Low Income Deviation is entered as a positive number but treated as a subtraction when included with all other deviations. By use of this deviation, court or jury is not prohibited from granting an increase or decrease to the presumptive amount of child support by use of another deviation.",null,null,null,null,null,"Court or Jury Allowable Deviations\nOnly the Court or Jury may enter an amount under column (c) or (d)."]
[null,false,"To request Low Income Deviation, click in box at left, check mark will display.  White fields in Line 1a for Noncustodial Parent will become yellow in color and allow data entry.  Uncheck box to remove request.  Continue to Line 1a.",null,null,"(a) Mother","(b) Father","*(c) Mother","*(d) Father"]
[null,"1a.","Enter \"Proposed Low Income Deviation amount\" AS A POSITIVE NUMBER under noncustodial parent's column. Amount will be used unless Line 1b applies.",null,null,0,0,0,0]
[null,"1b.",">If amount entered in Line 1a will make final child support obligation less than minimum order amount allowed when Low Income Deviation is granted, new deviation amount will display in Line 1b and used in calculations.\n>If entry in Line 1a results in amount equal to or greater than minimum order allowed, amount in Line 1a will automatically be used in the calculations.",null,null,0,0,0,0]
{"$rows_left_out":93}
{"sheet":"Schedule E Supplemental Tables","index":10,"n_rows":110,"n_cols":9,"rows_kept":110,"cut":false,"hidden":false,"merged":[[64,4,65,4],[64,1,64,3],[62,1,62,3],[66,1,66,3],[95,1,95,3],[99,0,100,0],[99,1,99,3],[85,1,85,3],[68,1,68,3],[91,1,91,3],[69,1,69,3],[74,0,74,8],[75,0,76,0],[77,5,77,7],[78,1,78,3],[77,0,77,3],[89,5,89,7],[75,1,76,4],[66,8,67,8],[62,8,63,8],[64,8,65,8],[66,4,67,4],[63,1,63,3],[53,1,53,3],[48,1,48,3],[32,1,32,3],[40,0,40,3],[38,0,39,0],[38,1,39,4],[47,1,47,3],[30,1,30,3],[62,4,63,4],[59,1,59,3],[49,1,49,3],[61,0,61,3],[57,1,57,3],[58,1,58,3],[54,1,54,3],[45,1,45,3],[46,1,46,3],[52,0,52,3],[103,4,104,4],[99,8,100,8],[98,5,98,7],[101,8,102,8],[101,4,102,4],[103,8,104,8],[103,1,103,3],[104,1,104,3],[99,4,100,4],[106,1,106,3],[105,1,105,3],[94,1,94,3],[84,1,84,3],[97,1,97,3],[93,1,93,3],[92,1,92,3],[90,1,90,3],[79,1,79,3],[80,1,80,3],[87,1,87,3],[88,1,88,3],[81,1,81,3],[86,1,86,3],[98,0,98,3],[96,1,96,3],[83,1,83,3],[82,1,82,3],[89,0,89,3],[100,1,100,3],[101,1,101,3],[102,1,102,3],[101,0,102,0],[103,0,104,0],[28,1,28,3],[25,4,26,4],[40,5,40,7],[44,1,44,3],[31,1,31,3],[29,1,29,3],[42,1,42,3],[43,1,43,3],[37,0,37,8],[41,1,41,3],[29,0,30,0],[29,8,30,8],[29,4,30,4],[0,0,0,8],[25,8,26,8],[27,0,28,0],[27,8,28,8],[27,4,28,4],[8,1,8,3],[1,0,2,0],[1,1,2,4],[26,1,26,3],[24,0,24,3],[20,1,20,3],[23,1,23,3],[25,1,25,3],[27,1,27,3],[4,1,4,3],[13,1,13,3],[5,1,5,3],[10,1,10,3],[16,1,16,3],[17,1,17,3],[9,1,9,3],[19,1,19,3],[11,1,11,3],[12,1,12,3],[6,1,6,3],[3,5,3,7],[15,5,15,7],[24,5,24,7],[3,0,3,3],[15,0,15,3],[7,1,7,3],[67,1,67,3],[64,0,65,0],[66,0,67,0],[65,1,65,3],[62,0,63,0],[60,1,60,3],[56,1,56,3],[14,1,14,3],[18,1,18,3],[25,0,26,0],[21,1,21,3],[22,1,22,3],[50,1,50,3],[52,5,52,7],[61,5,61,7],[55,1,55,3],[51,1,51,3]]}
["Schedule E-Deviations-Supplemental Table 2. Use this table to calculate amount for Line 12 Schedule E, children 4, 5 and 6. For additional children use Supplemental Table 3 and/or 4. Enter amounts/data in yellow fields only.  Calculations automatically display in appropriate white fields on this schedule."]
["1.","Children's Names →\n(Names will automatically display)",null,null,null,"Child 4","Child 5","Child 6"]
[null,null,null,null,null,{"$f":"CONCATENATE('CS Worksheet'!$D$21)","v":""},{"$f":"CONCATENATE('CS Worksheet'!$D$22)","v":""},{"$f":"CONCATENATE('CS Worksheet'!$D$23)","v":""}]
["Extraordinary Educational Expenses",null,null,null,"Paid by",null,null,null,"Totals"]
["2.","Total yearly amount paid for Tuition, Room & Board, Fees and Books",null,null,"Mother",0,0,0,{"$f":"SUMIF('CS Worksheet'!$C$21,TRUE,F5)+SUMIF('CS Worksheet'!$C$22,TRUE,G5)+SUMIF('CS Worksheet'!$C$23,TRUE,H5)","v":0}]
["3.","Total yearly amount paid for Other Extraordinary Educational Expenses ",null,null,"Mother",0,0,0,{"$f":"SUMIF('CS Worksheet'!$C$21,TRUE,F6)+SUMIF('CS Worksheet'!$C$22,TRUE,G6)+SUMIF('CS Worksheet'!$C$23,TRUE,H6)","v":0}]
["4.","Total yearly amount paid for Tuition, Room & Board, Fees and Books",null,null,"Father",0,0,0,{"$f":"SUMIF('CS Worksheet'!$C$21,TRUE,F7)+SUMIF('CS Worksheet'!$C$22,TRUE,G7)+SUMIF('CS Worksheet'!$C$23,TRUE,H7)","v":0}]
["5.","Total yearly amount paid for Other Extraordinary Educational Expenses ",null,null,"Father",0,0,0,{"$f":"SUMIF('CS Worksheet'!$C$21,TRUE,F8)+SUMIF('CS Worksheet'!$C$22,TRUE,G8)+SUMIF('CS Worksheet'!$C$23,TRUE,H8)","v":0}]
{"$rows_left_out":103}
{"sheet":"Footnotes","index":11,"n_rows":42,"n_cols":3,"rows_kept":42,"cut":false,"hidden":false,"merged":[[21,4,21,6]]}
["Schedule","Line No.","Footnotes"]
[]
[]
[]
[]
[]
[]
[]
{"$rows_left_out":35}
{"sheet":"Explanation of Terms","index":12,"n_rows":68,"n_cols":2,"rows_kept":68,"cut":false,"hidden":false,"merged":[]}
["Terms","Explanation"]
["Actual amount paid monthly","The amount of current child support being paid and averaged over a 12 month period as a result of a Preexisting Child Support Order that is supported by documentation including, but not limited to, a payment history from a court clerk, a IV-D agency, the Child Support Services Agency computer date base, canceled checks or other written proof of payments paid directly to the other Parent. Amounts paid on arrears are not included."]
["Adjusted Income","Adjusted income means the determination of a parent's monthly income, calculated by deducting from that parent's monthly gross income one-half of the amount of any applicable self-employment taxes being paid by the parent, any preexisting order for current child support which is being paid by the parent, and any theoretical child support order for other qualified children, if allowed by the court. For further reference see paragraph (5) of subsection (f) of this Code section."]
["Alimony","Alimony is actual payment allowances for support made under a court order and usually given by a man or woman to his former partner after a divorce or legal separation for livelihood maintenance. This amount is not considered as a deduction from the Gross Income of the Parent, but may be considered as a Deviation from the Presumptive Amount of Child Support for that Parent."]
["Basic Child Support Obligation","Basic child support obligation means the monthly amount of support displayed on the child support obligation table which corresponds to the combined adjusted income of the number of children for whom child support is being determined."]
["Child","Child means child or children who are minors and may apply to the child(ren) in this action, children who are in a pre-existing child support order or Other Qualified Child(ren)."]
["Child and Dependent Care Tax Credit","Child and Dependent Care Tax Credit means a Parent is eligible for a tax credit on their Federal Income Tax Return because they paid someone to care for a child so that they could work or look for work."]
["Child Care Expenses","Expenses for the care of a minor child for whom support is being determined in this action due to the employment, job search, training or education of either Parent. The cost may be estimated and averaged for the next consecutive 12 months to obtain a monthly amount."]
{"$rows_left_out":61}
{"sheet":"BCSO","index":13,"n_rows":594,"n_cols":8,"rows_kept":594,"cut":false,"hidden":false,"merged":[[0,0,1,7],[2,0,2,7],[3,0,3,7]]}
["Georgia"]
[]
["Schedule of Basic Child Support Obligations"]
[]
["COMBINED"]
["ADJUSTED",null,"ONE","TWO","THREE","FOUR","FIVE","SIX"]
["GROSS",null,"CHILD","CHILDREN","CHILDREN","CHILDREN","CHILDREN","CHILDREN"]
["INCOME"]
{"$rows_left_out":586}